Target
Sodium channel protein type 1 subunit alpha
Ligand
BDBM373762
Substrate
Meas. Tech.
Electrophysiological Assay
IC50
>10000±n/a nM
Citation
 Andrez, JBurford, KNChowdhury, SCohen, CJDehnhardt, CMDevita, RJEmpfield, JRFocken, TGrimwood, MEHasan, SAJohnson, Jr., JPZenova, AY Benzenesulfonamide compounds and their use as therapeutic agents US Patent  US10662184 Publication Date 5/26/2020 
Target
Name:
Sodium channel protein type 1 subunit alpha
Synonyms:
NAC1 SCN1A Sodium (Site 1) Sodium channel protein type 1 subunit alpha Sodium channel protein type I subunit alpha Voltage-gated sodium channel subunit alpha Nav1.1
Type:
Protein
Mol. Mass.:
228952.47
Organism:
Homo sapiens (Human)
Description:
P35498
Residue:
2009
  
Inhibitor
Name:
BDBM373762
Synonyms:
(S)-4-((1-benzylpyrrolidin-3-yl)(methyl)amino)-3-chloro-N-(1,2,4-thiadiazol-5-yl)benzenesulfonamide hydrochloride salt US10662184, Example 29 US11299490, Example 29
Type:
Small organic molecule
Emp. Form.:
C20H22ClN5O2S2
Mol. Mass.:
464.004
SMILES:
CN([C@H]1CCN(Cc2ccccc2)C1)c1ccc(cc1Cl)S(=O)(=O)Nc1ncns1
: