Target
Sodium channel protein type 8 subunit alpha
Ligand
BDBM373810
Substrate
Meas. Tech.
Electrophysiological Assay
IC50
5567±n/a nM
Citation
 Andrez, JBurford, KNChowdhury, SCohen, CJDehnhardt, CMDevita, RJEmpfield, JRFocken, TGrimwood, MEHasan, SAJohnson, Jr., JPZenova, AY Benzenesulfonamide compounds and their use as therapeutic agents US Patent  US10662184 Publication Date 5/26/2020 
Target
Name:
Sodium channel protein type 8 subunit alpha
Synonyms:
MED SCN8A_HUMAN Sodium channel protein type 8 subunit alpha Voltage-gated sodium channel subunit alpha Nav1.6 | ep nav1.6
Type:
PROTEIN
Mol. Mass.:
225271.59
Organism:
Homo sapiens (Human)
Description:
ChEMBL_1516902
Residue:
1980
  
Inhibitor
Name:
BDBM373810
Synonyms:
4-((1-benzylpiperidin-4-yl)oxy)-3-chloro-N-(6-fluoropyridin-2-yl)benzenesulfonamide 2,2,2-trifluoroacetate US10662184, Example 77 US11299490, Example 77
Type:
Small organic molecule
Emp. Form.:
C23H23ClFN3O3S
Mol. Mass.:
475.963
SMILES:
Fc1cccc(NS(=O)(=O)c2ccc(OC3CCN(Cc4ccccc4)CC3)c(Cl)c2)n1
: