Target
Sodium channel protein type 8 subunit alpha
Ligand
BDBM373834
Substrate
Meas. Tech.
Electrophysiological Assay
IC50
54.0±n/a nM
Citation
 Andrez, JBurford, KNChowdhury, SCohen, CJDehnhardt, CMDevita, RJEmpfield, JRFocken, TGrimwood, MEHasan, SAJohnson, Jr., JPZenova, AY Benzenesulfonamide compounds and their use as therapeutic agents US Patent  US10662184 Publication Date 5/26/2020 
Target
Name:
Sodium channel protein type 8 subunit alpha
Synonyms:
MED SCN8A_HUMAN Sodium channel protein type 8 subunit alpha Voltage-gated sodium channel subunit alpha Nav1.6 | ep nav1.6
Type:
PROTEIN
Mol. Mass.:
225271.59
Organism:
Homo sapiens (Human)
Description:
ChEMBL_1516902
Residue:
1980
  
Inhibitor
Name:
BDBM373834
Synonyms:
(S)-4-((1-benzylpyrrolidin-3-yl)(methyl)amino)-2-fluoro-5-methyl-N-(thiazol-4-yl)benzenesulfonamide formate US10662184, Example 101 | US11299490, Example 101
Type:
Small organic molecule
Emp. Form.:
C22H25FN4O2S2
Mol. Mass.:
460.588
SMILES:
CN(C1CCN(Cc2ccccc2)C1)c1cc(F)c(cc1C)S(=O)(=O)Nc1cscn1
: