Target
Sodium channel protein type 8 subunit alpha
Ligand
BDBM373958
Substrate
Meas. Tech.
Electrophysiological Assay
IC50
5310±n/a nM
Citation
 Andrez, JBurford, KNChowdhury, SCohen, CJDehnhardt, CMDevita, RJEmpfield, JRFocken, TGrimwood, MEHasan, SAJohnson, Jr., JPZenova, AY Benzenesulfonamide compounds and their use as therapeutic agents US Patent  US10662184 Publication Date 5/26/2020 
Target
Name:
Sodium channel protein type 8 subunit alpha
Synonyms:
MED SCN8A_HUMAN Sodium channel protein type 8 subunit alpha Voltage-gated sodium channel subunit alpha Nav1.6 | ep nav1.6
Type:
PROTEIN
Mol. Mass.:
225271.59
Organism:
Homo sapiens (Human)
Description:
ChEMBL_1516902
Residue:
1980
  
Inhibitor
Name:
BDBM373958
Synonyms:
(R)-4-((1-benzyl-3-methylpyrrolidin-3-yl)amino)-3-chloro-N-(thiazol-4-yl)benzenesulfonamide formate US10662184, Example 225 US11299490, Example 225
Type:
Small organic molecule
Emp. Form.:
C21H23ClN4O2S2
Mol. Mass.:
463.016
SMILES:
C[C@]1(CCN(Cc2ccccc2)C1)Nc1ccc(cc1Cl)S(=O)(=O)Nc1cscn1
: