Target
Sodium channel protein type 8 subunit alpha
Ligand
BDBM373986
Substrate
Meas. Tech.
Electrophysiological Assay
IC50
491±n/a nM
Citation
 Andrez, JBurford, KNChowdhury, SCohen, CJDehnhardt, CMDevita, RJEmpfield, JRFocken, TGrimwood, MEHasan, SAJohnson, Jr., JPZenova, AY Benzenesulfonamide compounds and their use as therapeutic agents US Patent  US10662184 Publication Date 5/26/2020 
Target
Name:
Sodium channel protein type 8 subunit alpha
Synonyms:
MED SCN8A_HUMAN Sodium channel protein type 8 subunit alpha Voltage-gated sodium channel subunit alpha Nav1.6 | ep nav1.6
Type:
PROTEIN
Mol. Mass.:
225271.59
Organism:
Homo sapiens (Human)
Description:
ChEMBL_1516902
Residue:
1980
  
Inhibitor
Name:
BDBM373986
Synonyms:
(S)-3-chloro-4-((1-(3-(difluoromethyl)benzyl)pyrrolidin-3-yl)(methyl)amino)-N-(thiazol-4-yl)benzenesulfonamide formate US10662184, Example 253 US11299490, Example 253
Type:
Small organic molecule
Emp. Form.:
C22H23ClF2N4O2S2
Mol. Mass.:
513.023
SMILES:
CN([C@H]1CCN(Cc2cccc(c2)C(F)F)C1)c1ccc(cc1Cl)S(=O)(=O)Nc1cscn1
: