Target
Tyrosine-protein kinase BTK
Ligand
BDBM444746
Substrate
Meas. Tech.
Kinase Assay
IC50
55±n/a nM
Citation
 Liao, XLi, JLu, ZZhou, YGao, A Bruton's tyrosine kinase inhibitors US Patent  US10662187 Publication Date 5/26/2020 
Target
Name:
Tyrosine-protein kinase BTK
Synonyms:
AGMX1 Agammaglobulinaemia tyrosine kinase B cell progenitor kinase BPK BTK_HUMAN Tyrosine Kinase BTK Tyrosine-protein kinase BTK (BTK)
Type:
Enzyme
Mol. Mass.:
76289.95
Organism:
Homo sapiens (Human)
Description:
Q06187
Residue:
659
  
Inhibitor
Name:
BDBM444746
Synonyms:
US10662187, Compound 116 | US10793566, Compound 116
Type:
Small organic molecule
Emp. Form.:
C27H22F3N5O2
Mol. Mass.:
505.4911
SMILES:
FC(F)(F)c1cccc(c1)C(=O)Nc1ccc(cc1)-c1nn(C2CCN(C2)C(=O)C=C)c2ccncc12
: