Target
Epidermal growth factor receptor
Ligand
BDBM444636
Substrate
Meas. Tech.
Kinase Assay
IC50
550±n/a nM
Citation
 Liao, XLi, JLu, ZZhou, YGao, A Bruton's tyrosine kinase inhibitors US Patent  US10662187 Publication Date 5/26/2020 
Target
Name:
Epidermal growth factor receptor
Synonyms:
EGF Receptor Substrate EGFR_HUMAN ERBB1 Epidermal Growth Factor Receptor erbB-1 Epidermal growth factor receptor (EGFR) HER1 Proto-oncogene c-ErbB-1 Tyrosine-Protein Kinase ErbB-1
Type:
Receptor Kinase Domain
Mol. Mass.:
134279.59
Organism:
Homo sapiens (Human)
Description:
P00533
Residue:
1210
  
Inhibitor
Name:
BDBM444636
Synonyms:
US10662187, Compound 6
Type:
Small organic molecule
Emp. Form.:
C25H25FN4O3
Mol. Mass.:
448.4894
SMILES:
COc1cccc(Oc2ccc(cc2)-c2nn([C@@H]3CCCNC3)c3c(OC)cncc23)c1F
: