Target
cAMP-specific 3',5'-cyclic phosphodiesterase 4B
Ligand
BDBM444827
Substrate
Meas. Tech.
Inhibitory Effect on the Enzyme In Vitro Assay
IC50
<0.500±n/a nM
Citation
 Luo, YYang, CLei, MLiu, LHu, GLi, JChen, S PDE4 inhibitor US Patent  US10662189 Publication Date 5/26/2020 
Target
Name:
cAMP-specific 3',5'-cyclic phosphodiesterase 4B
Synonyms:
3',5'-cyclic phosphodiesterase Isoform PDE4B1 PDE4B PDE4B_HUMAN Phosphodiesterase 4B (PDE4B) Phosphodiesterase Type 4 (PDE4B)
Type:
Protein
Mol. Mass.:
83318.87
Organism:
Homo sapiens (Human)
Description:
Q07343
Residue:
736
  
Inhibitor
Name:
BDBM444827
Synonyms:
US10662189, Compound WX078
Type:
Small organic molecule
Emp. Form.:
C24H23F2N3O5S
Mol. Mass.:
503.518
SMILES:
CCOc1cc(ccc1OC(F)F)C(CS(C)(=O)=O)n1c2nccc(-c3ccccc3)c2[nH]c1=O
: