Target
Calcium release-activated calcium channel protein 1
Ligand
BDBM444853
Substrate
Meas. Tech.
In-Vitro CRAC Channel Inhibition Assay in Jurkat Cells
IC50
436±n/a nM
Citation
 Muthuppalaniappan, MViswanadha, SMerikapudi, GSVakkalanka, SK Modulators of calcium release-activated calcium channel US Patent  US10668051 Publication Date 6/2/2020 
Target
Name:
Calcium release-activated calcium channel protein 1
Synonyms:
CRACM1 Calcium channel (VER) Calcium release-activated calcium channel protein 1 Protein orai-1 Transmembrane protein 142A
Type:
Protein
Mol. Mass.:
32676.63
Organism:
Homo sapiens (Human)
Description:
Q96D31
Residue:
301
  
Inhibitor
Name:
BDBM444853
Synonyms:
US10668051, Compound Example 45
Type:
Small organic molecule
Emp. Form.:
C22H20F2N4O
Mol. Mass.:
394.4172
SMILES:
Nc1cc(NC(=O)c2c(F)cccc2F)ccc1-n1nc(cc1C1CC1)C1CC1
: