Target
Calcium release-activated calcium channel protein 1
Ligand
BDBM141425
Substrate
Meas. Tech.
In-Vitro CRAC Channel Inhibition Assay in Jurkat Cells
IC50
48.2±n/a nM
Citation
 Muthuppalaniappan, MViswanadha, SMerikapudi, GSVakkalanka, SK Modulators of calcium release-activated calcium channel US Patent  US10668051 Publication Date 6/2/2020 
Target
Name:
Calcium release-activated calcium channel protein 1
Synonyms:
CRACM1 Calcium channel (VER) Calcium release-activated calcium channel protein 1 Protein orai-1 Transmembrane protein 142A
Type:
Protein
Mol. Mass.:
32676.63
Organism:
Homo sapiens (Human)
Description:
Q96D31
Residue:
301
  
Inhibitor
Name:
BDBM141425
Synonyms:
US10668051, Compound Example 83 | US8921364, 83
Type:
Small organic molecule
Emp. Form.:
C18H14F4N4OS
Mol. Mass.:
410.389
SMILES:
Cc1ncsc1C(=O)Nc1ccc(c(F)c1)-n1nc(cc1C1CC1)C(F)(F)F
: