Target
Sodium channel protein type 9 subunit alpha
Ligand
BDBM444872
Substrate
Meas. Tech.
Nav 1.7In Vitro PX Assay
IC50
43.0±n/a nM
Citation
 Weiss, MButler, JRMilgram, BCRescourio, GBoezio, ASparling, BALa, D Pyridine sulfonamides US Patent  US10668067 Publication Date 6/2/2020 
Target
Name:
Sodium channel protein type 9 subunit alpha
Synonyms:
NENA Peripheral sodium channel 1 SCN9A_HUMAN Voltage-gated sodium channel subunit Nav1.7 hNE-Na
Type:
Protein
Mol. Mass.:
226375.97
Organism:
Homo sapiens (Human)
Description:
Q15858
Residue:
1988
  
Inhibitor
Name:
BDBM444872
Synonyms:
6-((2,4'-dichloro-3',5-dimethoxy-4- | US10668067, Example 1-33
Type:
Small organic molecule
Emp. Form.:
C24H21Cl2N5O6S
Mol. Mass.:
578.424
SMILES:
CNC(=O)N(c1ccc(cn1)S(=O)(=O)Nc1ccon1)c1cc(Cl)c(cc1OC)-c1ccc(Cl)c(OC)c1
: