Target
Sodium channel protein type 9 subunit alpha
Ligand
BDBM444926
Substrate
Meas. Tech.
Nav 1.7In Vitro PX Assay
IC50
14.0±n/a nM
Citation
 Weiss, MButler, JRMilgram, BCRescourio, GBoezio, ASparling, BALa, D Pyridine sulfonamides US Patent  US10668067 Publication Date 6/2/2020 
Target
Name:
Sodium channel protein type 9 subunit alpha
Synonyms:
NENA Peripheral sodium channel 1 SCN9A_HUMAN Voltage-gated sodium channel subunit Nav1.7 hNE-Na
Type:
Protein
Mol. Mass.:
226375.97
Organism:
Homo sapiens (Human)
Description:
Q15858
Residue:
1988
  
Inhibitor
Name:
BDBM444926
Synonyms:
6-((2,4'-difluoro-5-methoxy-3'-(trifluoromethoxy)-4- | US10668067, Example 1-87
Type:
Small organic molecule
Emp. Form.:
C25H19F5N6O5S
Mol. Mass.:
610.513
SMILES:
CNC(=O)N(c1ccc(cn1)S(=O)(=O)Nc1ncccn1)c1cc(F)c(cc1OC)-c1ccc(F)c(OC(F)(F)F)c1
: