Target
Sodium channel protein type 9 subunit alpha
Ligand
BDBM444933
Substrate
Meas. Tech.
Nav 1.7In Vitro PX Assay
IC50
75.0±n/a nM
Citation
 Weiss, MButler, JRMilgram, BCRescourio, GBoezio, ASparling, BALa, D Pyridine sulfonamides US Patent  US10668067 Publication Date 6/2/2020 
Target
Name:
Sodium channel protein type 9 subunit alpha
Synonyms:
NENA Peripheral sodium channel 1 SCN9A_HUMAN Voltage-gated sodium channel subunit Nav1.7 hNE-Na
Type:
Protein
Mol. Mass.:
226375.97
Organism:
Homo sapiens (Human)
Description:
Q15858
Residue:
1988
  
Inhibitor
Name:
BDBM444933
Synonyms:
6-((2-chloro-3',4',5'-trifluoro-5-methoxy-4- | US10668067, Example 2-5
Type:
Small organic molecule
Emp. Form.:
C24H18ClF3N6O4S
Mol. Mass.:
578.951
SMILES:
CNC(=O)N(c1ccc(cn1)S(=O)(=O)Nc1cccnn1)c1cc(Cl)c(cc1OC)-c1cc(F)c(F)c(F)c1
: