Target
Sodium channel protein type 9 subunit alpha
Ligand
BDBM444938
Substrate
Meas. Tech.
Nav 1.7In Vitro PX Assay
IC50
14.0±n/a nM
Citation
 Weiss, MButler, JRMilgram, BCRescourio, GBoezio, ASparling, BALa, D Pyridine sulfonamides US Patent  US10668067 Publication Date 6/2/2020 
Target
Name:
Sodium channel protein type 9 subunit alpha
Synonyms:
NENA Peripheral sodium channel 1 SCN9A_HUMAN Voltage-gated sodium channel subunit Nav1.7 hNE-Na
Type:
Protein
Mol. Mass.:
226375.97
Organism:
Homo sapiens (Human)
Description:
Q15858
Residue:
1988
  
Inhibitor
Name:
BDBM444938
Synonyms:
6-(1-(5-Fluoro-2-methoxy-4-tetradecylphenyl)-3-methylureido)-N-(pyrimidin-2-yl)pyridine-3-sulfonamide | US10668067, Example 2-11
Type:
Small organic molecule
Emp. Form.:
C32H45FN6O4S
Mol. Mass.:
628.801
SMILES:
CCCCCCCCCCCCCCc1cc(OC)c(cc1F)N(C(=O)NC)c1ccc(cn1)S(=O)(=O)Nc1ncccn1
: