Target
Sodium channel protein type 9 subunit alpha
Ligand
BDBM444973
Substrate
Meas. Tech.
Nav 1.7In Vitro PX Assay
IC50
400±n/a nM
Citation
 Weiss, MButler, JRMilgram, BCRescourio, GBoezio, ASparling, BALa, D Pyridine sulfonamides US Patent  US10668067 Publication Date 6/2/2020 
Target
Name:
Sodium channel protein type 9 subunit alpha
Synonyms:
NENA Peripheral sodium channel 1 SCN9A_HUMAN Voltage-gated sodium channel subunit Nav1.7 hNE-Na
Type:
Protein
Mol. Mass.:
226375.97
Organism:
Homo sapiens (Human)
Description:
Q15858
Residue:
1988
  
Inhibitor
Name:
BDBM444973
Synonyms:
4-(1-(4′-chloro-3-methoxy-3′-methyl-[1,1′-biphenyl]-4-yl)-3methylureido)-N-(isoxazol-3-yl)benzenesulfonamide | US10668067, Example 9
Type:
Small organic molecule
Emp. Form.:
C31H26ClN3O5S
Mol. Mass.:
588.073
SMILES:
COc1cc(ccc1Nc1ccc(cc1)S(=O)(=O)N(Cc1ccc(C=O)cc1)c1ccon1)-c1ccc(Cl)c(C)c1
: