Target
Plasminogen [101-181]
Ligand
BDBM290312
Substrate
Meas. Tech.
Plasma-Based Clot Lysis Assay
IC50
14.0±n/a nM
Citation
 Haßfeld, JKinzel, TKöbberling, JCancho-Grande, YBeyer, KRöhrig, SKöllnberger, MSperzel, MBurkhardt, NSchlemmer, KStegmann, CSchuhmacher, JWerner, MEllermann, M (Aza)pyridopyrazolopyrimidinones and indazolopyrimidinones and their use US Patent  US10668071 Publication Date 6/2/2020 
Target
Name:
Plasminogen [101-181]
Synonyms:
PLG Plasminogen (aa 101-181)
Type:
Enzyme Catalytic Domain
Mol. Mass.:
9281.08
Organism:
Homo sapiens (Human)
Description:
P00747[101-181]
Residue:
81
  
Inhibitor
Name:
BDBM290312
Synonyms:
4-(Piperidin-4-yl)-10-[4-(trifluoromethyl)phenyl]pyrimido[1,2-b]indazol-2(1H)-one hydrochloride US10668071, Example 55
Type:
Small organic molecule
Emp. Form.:
C22H19F3N4O
Mol. Mass.:
412.4077
SMILES:
FC(F)(F)c1ccc(cc1)-c1cccc2nn3c(cc(=O)[nH]c3c12)C1CCNCC1
: