Target
Glucocorticoid receptor
Ligand
BDBM445002
Substrate
Meas. Tech.
Glucocorticoid Receptor Binding Assay
IC50
13.9±n/a nM
Citation
 McPherson, MJHobson, ADHayes, MEMarvin, CCSchmidt, DWaegell, WGoess, COh, JZHernandez, Jr., ARandolph, JT Glucocorticoid receptor agonist and immunoconjugates thereof US Patent  US10668167 Publication Date 6/2/2020 
Target
Name:
Glucocorticoid receptor
Synonyms:
GCR_HUMAN GRL Glucocorticoid receptor (GRFP) Nuclear receptor subfamily 3 group C member 1
Type:
Enzyme
Mol. Mass.:
85656.87
Organism:
Homo sapiens (Human)
Description:
P04150
Residue:
777
  
Inhibitor
Name:
BDBM445002
Synonyms:
US10668167, Compound 11
Type:
Small organic molecule
Emp. Form.:
C35H37F2NO6S
Mol. Mass.:
637.733
SMILES:
C[C@]12C[C@H](O)[C@@]3(F)[C@@H](C[C@H](F)C4=CC(=O)C=C[C@]34C)[C@@H]1C[C@H]1O[C@@H](O[C@@]21C(=O)CO)c1ccc(CSc2cccc(N)c2)cc1
: