Target
Progesterone receptor
Ligand
BDBM445015
Substrate
Meas. Tech.
Progesterone Receptor Binding Assay
IC50
8.90±n/a nM
Citation
 McPherson, MJHobson, ADHayes, MEMarvin, CCSchmidt, DWaegell, WGoess, COh, JZHernandez, Jr., ARandolph, JT Glucocorticoid receptor agonist and immunoconjugates thereof US Patent  US10668167 Publication Date 6/2/2020 
Target
Name:
Progesterone receptor
Synonyms:
NR3C3 PGR PRGR_HUMAN | progesterone
Type:
Protein
Mol. Mass.:
98979.52
Organism:
Homo sapiens (Human)
Description:
P06401
Residue:
933
  
Inhibitor
Name:
BDBM445015
Synonyms:
US10668167, Compound 24
Type:
Small organic molecule
Emp. Form.:
C35H37F2NO6
Mol. Mass.:
605.6682
SMILES:
C[C@]12C[C@H](O)[C@@]3(F)[C@@H](C[C@H](F)C4=CC(=O)C=C[C@]34C)[C@@H]1C[C@H]1O[C@H](O[C@@]21C(=O)CO)c1ccc(Cc2ccc(N)cc2)cc1
: