Target
Glucocorticoid receptor
Ligand
BDBM445020
Substrate
Meas. Tech.
Glucocorticoid Receptor Binding Assay
IC50
14.6±n/a nM
Citation
 McPherson, MJHobson, ADHayes, MEMarvin, CCSchmidt, DWaegell, WGoess, COh, JZHernandez, Jr., ARandolph, JT Glucocorticoid receptor agonist and immunoconjugates thereof US Patent  US10668167 Publication Date 6/2/2020 
Target
Name:
Glucocorticoid receptor
Synonyms:
GCR_HUMAN GRL Glucocorticoid receptor (GRFP) Nuclear receptor subfamily 3 group C member 1
Type:
Enzyme
Mol. Mass.:
85656.87
Organism:
Homo sapiens (Human)
Description:
P04150
Residue:
777
  
Inhibitor
Name:
BDBM445020
Synonyms:
US10668167, Compound 28
Type:
Small organic molecule
Emp. Form.:
C36H39F2NO6
Mol. Mass.:
619.6948
SMILES:
CNc1ccc(Cc2ccc(cc2)[C@H]2O[C@@H]3C[C@H]4[C@@H]5C[C@H](F)C6=CC(=O)C=C[C@]6(C)[C@@]5(F)[C@@H](O)C[C@]4(C)[C@@]3(O2)C(=O)CO)cc1
: