Target
Estrogen receptor
Ligand
BDBM445024
Substrate
Meas. Tech.
Estrogen Receptor Binding Assay
IC50
30000±n/a nM
Citation
 McPherson, MJHobson, ADHayes, MEMarvin, CCSchmidt, DWaegell, WGoess, COh, JZHernandez, Jr., ARandolph, JT Glucocorticoid receptor agonist and immunoconjugates thereof US Patent  US10668167 Publication Date 6/2/2020 
Target
Name:
Estrogen receptor
Synonyms:
ER ESR ESR1_HUMAN Estrogen receptor Estrogen receptor (ER-alpha) Estrogen receptor alpha (ER) Nuclear receptor subfamily 3 group A member 1
Type:
Protein
Mol. Mass.:
66230.44
Organism:
Homo sapiens (Human)
Description:
P03372
Residue:
595
  
Inhibitor
Name:
BDBM445024
Synonyms:
US10668167, Compound 32
Type:
Small organic molecule
Emp. Form.:
C36H39F2NO7
Mol. Mass.:
635.6942
SMILES:
COc1cc(Cc2ccc(cc2)[C@@H]2O[C@@H]3C[C@H]4[C@@H]5C[C@H](F)C6=CC(=O)C=C[C@]6(C)[C@@]5(F)[C@@H](O)C[C@]4(C)[C@@]3(O2)C(=O)CO)ccc1N
: