Target
Estrogen receptor
Ligand
BDBM445029
Substrate
Meas. Tech.
Estrogen Receptor Binding Assay
IC50
>30000±n/a nM
Citation
 McPherson, MJHobson, ADHayes, MEMarvin, CCSchmidt, DWaegell, WGoess, COh, JZHernandez, Jr., ARandolph, JT Glucocorticoid receptor agonist and immunoconjugates thereof US Patent  US10668167 Publication Date 6/2/2020 
Target
Name:
Estrogen receptor
Synonyms:
ER ESR ESR1_HUMAN Estrogen receptor Estrogen receptor (ER-alpha) Estrogen receptor alpha (ER) Nuclear receptor subfamily 3 group A member 1
Type:
Protein
Mol. Mass.:
66230.44
Organism:
Homo sapiens (Human)
Description:
P03372
Residue:
595
  
Inhibitor
Name:
BDBM445029
Synonyms:
US10668167, Compound 37
Type:
Small organic molecule
Emp. Form.:
C35H40FN3O6
Mol. Mass.:
617.707
SMILES:
C[C@@H](Nc1ccc(cn1)[C@@H]1O[C@@H]2C[C@H]3[C@@H]4CCC5=CC(=O)C=C[C@]5(C)[C@@]4(F)[C@@H](O)C[C@]3(C)[C@@]2(O1)C(=O)CO)c1ccc(N)cc1
: