Target
Estrogen receptor
Ligand
BDBM445047
Substrate
Meas. Tech.
Estrogen Receptor Binding Assay
IC50
>30000±n/a nM
Citation
 McPherson, MJHobson, ADHayes, MEMarvin, CCSchmidt, DWaegell, WGoess, COh, JZHernandez, Jr., ARandolph, JT Glucocorticoid receptor agonist and immunoconjugates thereof US Patent  US10668167 Publication Date 6/2/2020 
Target
Name:
Estrogen receptor
Synonyms:
ER ESR ESR1_HUMAN Estrogen receptor Estrogen receptor (ER-alpha) Estrogen receptor alpha (ER) Nuclear receptor subfamily 3 group A member 1
Type:
Protein
Mol. Mass.:
66230.44
Organism:
Homo sapiens (Human)
Description:
P03372
Residue:
595
  
Inhibitor
Name:
BDBM445047
Synonyms:
US10668167, Compound 59
Type:
Small organic molecule
Emp. Form.:
C34H36FNO6S
Mol. Mass.:
605.716
SMILES:
C[C@]12C[C@H](O)[C@@]3(F)[C@@H](CCC4=CC(=O)C=C[C@]34C)[C@@H]1C[C@H]1O[C@H](O[C@@]21C(=O)CO)c1ccc(Sc2cccc(N)c2)cc1
: