Target
Progesterone receptor
Ligand
BDBM445048
Substrate
Meas. Tech.
Progesterone Receptor Binding Assay
IC50
69.9±n/a nM
Citation
 McPherson, MJHobson, ADHayes, MEMarvin, CCSchmidt, DWaegell, WGoess, COh, JZHernandez, Jr., ARandolph, JT Glucocorticoid receptor agonist and immunoconjugates thereof US Patent  US10668167 Publication Date 6/2/2020 
Target
Name:
Progesterone receptor
Synonyms:
NR3C3 PGR PRGR_HUMAN | progesterone
Type:
Protein
Mol. Mass.:
98979.52
Organism:
Homo sapiens (Human)
Description:
P06401
Residue:
933
  
Inhibitor
Name:
BDBM445048
Synonyms:
US10668167, Compound 60
Type:
Small organic molecule
Emp. Form.:
C34H37NO6S
Mol. Mass.:
587.726
SMILES:
C[C@]12C[C@H](O)[C@H]3[C@@H](CCC4=CC(=O)C=C[C@]34C)[C@@H]1C[C@H]1O[C@H](O[C@@]21C(=O)CO)c1ccc(Sc2cccc(N)c2)cc1
: