Target
Ubiquitin carboxyl-terminal hydrolase isozyme L1
Ligand
BDBM445138
Substrate
Meas. Tech.
UCHL1 Biochemical IC50 Assay
IC50
5500±n/a nM
Citation
 Kemp, MStockley, MJones, A Cyanopyrrolidines as dub inhibitors for the treatment of cancer US Patent  US10669234 Publication Date 6/2/2020 
Target
Name:
Ubiquitin carboxyl-terminal hydrolase isozyme L1
Synonyms:
Neuron cytoplasmic protein 9.5 PGP9.5 UCHL1 Ubiquitin thioesterase L1
Type:
PROTEIN
Mol. Mass.:
24819.03
Organism:
Homo sapiens (Human)
Description:
ChEMBL_974327
Residue:
223
  
Inhibitor
Name:
BDBM445138
Synonyms:
(S)-1-cyano-N-(4-(2- cyanopyridin-4- yl)thiazol-2-yl)-N- methylpyrrolidine- 2-carboxamide US11319287, Example 78
Type:
Small organic molecule
Emp. Form.:
C16H14N6OS
Mol. Mass.:
338.387
SMILES:
CN(C(=O)[C@@H]1CCCN1C#N)c1nc(cs1)-c1ccnc(c1)C#N
: