Target
Ubiquitin carboxyl-terminal hydrolase isozyme L1
Ligand
BDBM445141
Substrate
Meas. Tech.
UCHL1 Biochemical IC50 Assay
IC50
5500±n/a nM
Citation
 Kemp, MStockley, MJones, A Cyanopyrrolidines as dub inhibitors for the treatment of cancer US Patent  US10669234 Publication Date 6/2/2020 
Target
Name:
Ubiquitin carboxyl-terminal hydrolase isozyme L1
Synonyms:
Neuron cytoplasmic protein 9.5 PGP9.5 UCHL1 Ubiquitin thioesterase L1
Type:
PROTEIN
Mol. Mass.:
24819.03
Organism:
Homo sapiens (Human)
Description:
ChEMBL_974327
Residue:
223
  
Inhibitor
Name:
BDBM445141
Synonyms:
1-(Cyano-L-prolyl)-4-phenylindoline-6-carboxamide US11319287, Example 85
Type:
Small organic molecule
Emp. Form.:
C20H25BrN2O5
Mol. Mass.:
453.327
SMILES:
COC(=O)c1cc2N(CCc2c(Br)c1)C(=O)[C@@H]1CCCN1C(=O)OC(C)(C)C
: