Target
Ubiquitin carboxyl-terminal hydrolase isozyme L1
Ligand
BDBM445163
Substrate
Meas. Tech.
UCHL1 Biochemical IC50 Assay
IC50
550±n/a nM
Citation
 Kemp, MStockley, MJones, A Cyanopyrrolidines as dub inhibitors for the treatment of cancer US Patent  US10669234 Publication Date 6/2/2020 
Target
Name:
Ubiquitin carboxyl-terminal hydrolase isozyme L1
Synonyms:
Neuron cytoplasmic protein 9.5 PGP9.5 UCHL1 Ubiquitin thioesterase L1
Type:
PROTEIN
Mol. Mass.:
24819.03
Organism:
Homo sapiens (Human)
Description:
ChEMBL_974327
Residue:
223
  
Inhibitor
Name:
BDBM445163
Synonyms:
(S)-2-(4-(2- (methylamino)pyrimidin- 4-yl)indoline-1- carbonyl)pyrrolidine-1- carbonitrile US11319287, Example 120
Type:
Small organic molecule
Emp. Form.:
C19H20N6O
Mol. Mass.:
348.4017
SMILES:
CNc1nccc(n1)-c1cccc2N(CCc12)C(=O)[C@@H]1CCCN1C#N
: