Target
Ubiquitin carboxyl-terminal hydrolase 30
Ligand
BDBM445110
Substrate
Meas. Tech.
USP30 Biochemical IC50 Assay
IC50
5500±n/a nM
Citation
 Kemp, MStockley, MJones, A Cyanopyrrolidines as dub inhibitors for the treatment of cancer US Patent  US10669234 Publication Date 6/2/2020 
Target
Name:
Ubiquitin carboxyl-terminal hydrolase 30
Synonyms:
Deubiquitinating enzyme 30 USP30 Ubiquitin carboxyl-terminal hydrolase 30 (USP30) Ubiquitin-specific-processing protease 30
Type:
Protein
Mol. Mass.:
58522.90
Organism:
Homo sapiens (Human)
Description:
Q70CQ3
Residue:
517
  
Inhibitor
Name:
BDBM445110
Synonyms:
(S)-1-cyano-N-methyl-N-(4- (pyridin-3-yl)thiazol-2- yl)pyrrolidine-2-carboxamide US11319287, Example 49
Type:
Small organic molecule
Emp. Form.:
C15H15N5OS
Mol. Mass.:
313.378
SMILES:
CN(C(=O)[C@@H]1CCCN1C#N)c1nc(cs1)-c1cccnc1
: