Target
Ubiquitin carboxyl-terminal hydrolase 30
Ligand
BDBM445153
Substrate
Meas. Tech.
USP30 Biochemical IC50 Assay
IC50
5500±n/a nM
Citation
 Kemp, MStockley, MJones, A Cyanopyrrolidines as dub inhibitors for the treatment of cancer US Patent  US10669234 Publication Date 6/2/2020 
Target
Name:
Ubiquitin carboxyl-terminal hydrolase 30
Synonyms:
Deubiquitinating enzyme 30 USP30 Ubiquitin carboxyl-terminal hydrolase 30 (USP30) Ubiquitin-specific-processing protease 30
Type:
Protein
Mol. Mass.:
58522.90
Organism:
Homo sapiens (Human)
Description:
Q70CQ3
Residue:
517
  
Inhibitor
Name:
BDBM445153
Synonyms:
1-(cyano-L-prolyl)-4- (3,4-dichlorophenyl)- N-methylindoline-6- carboxamide US11319287, Example 104
Type:
Small organic molecule
Emp. Form.:
C22H20Cl2N4O2
Mol. Mass.:
443.326
SMILES:
CNC(=O)c1cc2N(CCc2c(c1)-c1ccc(Cl)c(Cl)c1)C(=O)[C@@H]1CCCN1C#N
: