Target
Ubiquitin carboxyl-terminal hydrolase 30
Ligand
BDBM445186
Substrate
Meas. Tech.
USP30 Biochemical IC50 Assay
IC50
5500±n/a nM
Citation
 Kemp, MStockley, MJones, A Cyanopyrrolidines as dub inhibitors for the treatment of cancer US Patent  US10669234 Publication Date 6/2/2020 
Target
Name:
Ubiquitin carboxyl-terminal hydrolase 30
Synonyms:
Deubiquitinating enzyme 30 USP30 Ubiquitin carboxyl-terminal hydrolase 30 (USP30) Ubiquitin-specific-processing protease 30
Type:
Protein
Mol. Mass.:
58522.90
Organism:
Homo sapiens (Human)
Description:
Q70CQ3
Residue:
517
  
Inhibitor
Name:
BDBM445186
Synonyms:
(S)-2-(5-(4-cyanophenyl)- isoindoline-2-carbonyl)- pyrrolidine-1-carbonitrile US11319287, Example 113
Type:
Small organic molecule
Emp. Form.:
C21H18N4O
Mol. Mass.:
342.3938
SMILES:
O=C([C@@H]1CCCN1C#N)N1Cc2ccc(cc2C1)-c1ccc(cc1)C#N
: