Target
Ubiquitin carboxyl-terminal hydrolase 30
Ligand
BDBM445194
Substrate
Meas. Tech.
USP30 Biochemical IC50 Assay
IC50
550±n/a nM
Citation
 Kemp, MStockley, MJones, A Cyanopyrrolidines as dub inhibitors for the treatment of cancer US Patent  US10669234 Publication Date 6/2/2020 
Target
Name:
Ubiquitin carboxyl-terminal hydrolase 30
Synonyms:
Deubiquitinating enzyme 30 USP30 Ubiquitin carboxyl-terminal hydrolase 30 (USP30) Ubiquitin-specific-processing protease 30
Type:
Protein
Mol. Mass.:
58522.90
Organism:
Homo sapiens (Human)
Description:
Q70CQ3
Residue:
517
  
Inhibitor
Name:
BDBM445194
Synonyms:
(S)-2-(5-(3-nitrophenyl)- isoindoline-2-carbonyl)- pyrrolidine-1-carbonitrile US11319287, Example 133
Type:
Small organic molecule
Emp. Form.:
C20H18N4O3
Mol. Mass.:
362.3819
SMILES:
[O-][N+](=O)c1cccc(c1)-c1ccc2CN(Cc2c1)C(=O)[C@@H]1CCCN1C#N
: