Target
Ubiquitin carboxyl-terminal hydrolase 30
Ligand
BDBM445201
Substrate
Meas. Tech.
USP30 Biochemical IC50 Assay
IC50
<100±n/a nM
Citation
 Kemp, MStockley, MJones, A Cyanopyrrolidines as dub inhibitors for the treatment of cancer US Patent  US10669234 Publication Date 6/2/2020 
Target
Name:
Ubiquitin carboxyl-terminal hydrolase 30
Synonyms:
Deubiquitinating enzyme 30 USP30 Ubiquitin carboxyl-terminal hydrolase 30 (USP30) Ubiquitin-specific-processing protease 30
Type:
Protein
Mol. Mass.:
58522.90
Organism:
Homo sapiens (Human)
Description:
Q70CQ3
Residue:
517
  
Inhibitor
Name:
BDBM445201
Synonyms:
(S)-1-cyano-N-(4-(6-cyano-5-(dimethylamino)pyridin-2-yl)thiazol-2-yl)-N-methyl-pyrrolidine-2-carboxamide US11319287, Example 140
Type:
Small organic molecule
Emp. Form.:
C18H19N7OS
Mol. Mass.:
381.455
SMILES:
CN(C)c1ccc(nc1C#N)-c1csc(n1)N(C)C(=O)[C@@H]1CCCN1C#N
: