Target
Platelet-derived growth factor receptor beta
Ligand
BDBM445240
Substrate
Meas. Tech.
PDGFR beta Enzyme Inhibition
Ki
4.83±n/a nM
Citation
 Walters, IBirch, LCollingwood, SPStevenson, CS Indole derivatives and their use as protein kinase inhibitors US Patent  US10669235 Publication Date 6/2/2020 
Target
Name:
Platelet-derived growth factor receptor beta
Synonyms:
Beta-type platelet-derived growth factor receptor CD140b antigen PDGF Receptor Substrate PDGFR PDGFR-1 PDGFRB PGFRB_HUMAN Platelet-derived growth factor receptor 1 Platelet-derived growth factor receptor beta (PDGFR-beta) Platelet-derived growth factor receptor beta (PDGFRbeta) | VHL/PDGFRB
Type:
Enzyme
Mol. Mass.:
123922.25
Organism:
Homo sapiens (Human)
Description:
P09619
Residue:
1106
  
Inhibitor
Name:
BDBM445240
Synonyms:
US10669235, Example 31 | US11208381, Example 31
Type:
Small organic molecule
Emp. Form.:
C35H39N5O5
Mol. Mass.:
609.7147
SMILES:
COC(=O)c1cc2NC(=O)\C(=C(/Nc3ccc(cc3)C(=O)N3CCC(CC3)C(=O)NCCN(C)C)c3ccccc3)c2cc1C
: