Target
Fibroblast growth factor receptor 1
Ligand
BDBM445222
Substrate
Meas. Tech.
FGFR1 Enzyme Inhibition
Ki
19.6±n/a nM
Citation
 Walters, IBirch, LCollingwood, SPStevenson, CS Indole derivatives and their use as protein kinase inhibitors US Patent  US10669235 Publication Date 6/2/2020 
Target
Name:
Fibroblast growth factor receptor 1
Synonyms:
BFGFR Basic fibroblast growth factor receptor 1 (FGFR1) CEK FGFR-1 FGFR-1, (FL) FGFR1_HUMAN FLT2 Fibroblast growth factor receptor 1 (FGFR-1) Fms-like tyrosine kinase 2 N-sam bFGF-R | c-fgr
Type:
Receptor
Mol. Mass.:
91861.70
Organism:
Homo sapiens (Human)
Description:
P11362
Residue:
822
  
Inhibitor
Name:
BDBM445222
Synonyms:
US10669235, Example 13 US11208381, Example 49
Type:
Small organic molecule
Emp. Form.:
C32H34N4O5
Mol. Mass.:
554.6362
SMILES:
COC(=O)c1cc2NC(=O)\C(=C(/Nc3ccc(cc3)C(=O)NC3CCN(CCO)CC3)c3ccccc3)c2cc1C
: