Target
Fibroblast growth factor receptor 3
Ligand
BDBM445260
Substrate
Meas. Tech.
FGFR3 Enzyme Inhibition
Ki
10.8±n/a nM
Citation
 Walters, IBirch, LCollingwood, SPStevenson, CS Indole derivatives and their use as protein kinase inhibitors US Patent  US10669235 Publication Date 6/2/2020 
Target
Name:
Fibroblast growth factor receptor 3
Synonyms:
CD_antigen: CD333 FGFR3 Fibroblast growth factor receptor JTK4
Type:
Protein
Mol. Mass.:
87699.57
Organism:
Homo sapiens (Human)
Description:
P22607
Residue:
806
  
Inhibitor
Name:
BDBM445260
Synonyms:
US10669235, Example 51 | US11208381, Example 51
Type:
Small organic molecule
Emp. Form.:
C30H32N4O5
Mol. Mass.:
528.5989
SMILES:
COC(=O)c1cc2NC(=O)\C(=C(/Nc3ccc(cc3)C(=O)NCCN(C)CCO)c3ccccc3)c2cc1C
: