Target
High affinity nerve growth factor receptor
Ligand
BDBM412265
Substrate
Meas. Tech.
Evaluation of Binding Activity for Human TrkA Protein
IC50
<50±n/a nM
Citation
 Saitoh, FNagasue, H Tetrahydronaphthyl urea derivative US Patent  US10669239 Publication Date 6/2/2020 
Target
Name:
High affinity nerve growth factor receptor
Synonyms:
2.7.10.1 NTRK1 NTRK1_HUMAN Neurotrophic tyrosine kinase receptor type 1 Synonyms=MTC TRK1-transforming tyrosine kinase protein TRKA GN Tropomyosin alpha-3 chain/High affinity nerve growth factor receptor Tropomyosin-related kinase A (TrkA) Tyrosine kinase receptor (Trk) Tyrosine kinase receptor A (Trk A) Tyrosine kinase receptor A (TrkA) p140-TrkA
Type:
Mol. Mass.:
87498.18
Organism:
Homo sapiens (Human)
Description:
P04629
Residue:
796
  
Inhibitor
Name:
BDBM412265
Synonyms:
US10399945, Example 10 US10669239, Compound 18 | US10927079, Compound 10
Type:
Small organic molecule
Emp. Form.:
C29H31N5O2
Mol. Mass.:
481.5887
SMILES:
Cc1cc(NC(=O)N[C@H]2[C@H](O)CC(C)(C)c3ccccc23)c(nc1-c1cnn(C)c1)-c1ccccc1
: