Target
High affinity nerve growth factor receptor
Ligand
BDBM412303
Substrate
Meas. Tech.
Evaluation of Binding Activity for Human TrkA Protein
IC50
525±n/a nM
Citation
 Saitoh, FNagasue, H Tetrahydronaphthyl urea derivative US Patent  US10669239 Publication Date 6/2/2020 
Target
Name:
High affinity nerve growth factor receptor
Synonyms:
2.7.10.1 NTRK1 NTRK1_HUMAN Neurotrophic tyrosine kinase receptor type 1 Synonyms=MTC TRK1-transforming tyrosine kinase protein TRKA GN Tropomyosin alpha-3 chain/High affinity nerve growth factor receptor Tropomyosin-related kinase A (TrkA) Tyrosine kinase receptor (Trk) Tyrosine kinase receptor A (Trk A) Tyrosine kinase receptor A (TrkA) p140-TrkA
Type:
Mol. Mass.:
87498.18
Organism:
Homo sapiens (Human)
Description:
P04629
Residue:
796
  
Inhibitor
Name:
BDBM412303
Synonyms:
US10399945, Example 38 US10927079, Compound 38
Type:
Small organic molecule
Emp. Form.:
C25H25F2N3O2
Mol. Mass.:
437.4817
SMILES:
Cc1ccnc(-c2ccccc2)c1NC(=O)N[C@H]1[C@H](O)CC(C)(C)c2cc(F)c(F)cc12
: