Target
Isocitrate dehydrogenase [NADP] cytoplasmic
Ligand
BDBM445285
Substrate
Meas. Tech.
Kinase Assay
IC50
550±n/a nM
Citation
 Jiang, LGeng, MZheng, QHuang, MWan, HTang, SFu, XLan, XCao, JLiu, FDing, J Compound having mutant IDH inhibitory activity, preparation method and use thereof US Patent  US10682352 Publication Date 6/16/2020 
Target
Name:
Isocitrate dehydrogenase [NADP] cytoplasmic
Synonyms:
Cytosolic NADP-isocitrate dehydrogenase IDH1 IDP Isocitrate dehydrogenase 1 (IDH1) Oxalosuccinate decarboxylase | PICD
Type:
Protein
Mol. Mass.:
46661.29
Organism:
Homo sapiens (Human)
Description:
O75874
Residue:
414
  
Inhibitor
Name:
BDBM445285
Synonyms:
(S)-1-(2-((1-(1-(4-chlorophenyl)-1H-imidazol-4-yl)cyclopropyl)amino)pyrimidin-4-yl)-5-cyclopropyl imidazolidine-2-one | US10682352, Compound 15
Type:
Small organic molecule
Emp. Form.:
C22H22ClN7O
Mol. Mass.:
435.909
SMILES:
Clc1ccc(cc1)-n1cnc(c1)C1(CC1)Nc1nccc(n1)N1[C@H](CNC1=O)C1CC1
: