Target
Isocitrate dehydrogenase [NADP] cytoplasmic
Ligand
BDBM445334
Substrate
Meas. Tech.
Kinase Assay
IC50
<100±n/a nM
Citation
 Jiang, LGeng, MZheng, QHuang, MWan, HTang, SFu, XLan, XCao, JLiu, FDing, J Compound having mutant IDH inhibitory activity, preparation method and use thereof US Patent  US10682352 Publication Date 6/16/2020 
Target
Name:
Isocitrate dehydrogenase [NADP] cytoplasmic
Synonyms:
Cytosolic NADP-isocitrate dehydrogenase IDH1 IDP Isocitrate dehydrogenase 1 (IDH1) Oxalosuccinate decarboxylase | PICD
Type:
Protein
Mol. Mass.:
46661.29
Organism:
Homo sapiens (Human)
Description:
O75874
Residue:
414
  
Inhibitor
Name:
BDBM445334
Synonyms:
(S)-3-(2-((1-(1-(5-chloro-2-fluorophenyl)-1H-imidazol-4-yl)cyclopropyl)amino)pyrimidin-4-yl)-4-isopropyl-1-methylimidazolidine-2-one | US10682352, Compound 50
Type:
Small organic molecule
Emp. Form.:
C23H25ClFN7O
Mol. Mass.:
469.942
SMILES:
CC(C)[C@H]1CN(C)C(=O)N1c1ccnc(NC2(CC2)c2cn(cn2)-c2cc(Cl)ccc2F)n1
: