Target
Isocitrate dehydrogenase [NADP] cytoplasmic
Ligand
BDBM445370
Substrate
Meas. Tech.
Kinase Assay
IC50
<100±n/a nM
Citation
 Jiang, LGeng, MZheng, QHuang, MWan, HTang, SFu, XLan, XCao, JLiu, FDing, J Compound having mutant IDH inhibitory activity, preparation method and use thereof US Patent  US10682352 Publication Date 6/16/2020 
Target
Name:
Isocitrate dehydrogenase [NADP] cytoplasmic
Synonyms:
Cytosolic NADP-isocitrate dehydrogenase IDH1 IDP Isocitrate dehydrogenase 1 (IDH1) Oxalosuccinate decarboxylase | PICD
Type:
Protein
Mol. Mass.:
46661.29
Organism:
Homo sapiens (Human)
Description:
O75874
Residue:
414
  
Inhibitor
Name:
BDBM445370
Synonyms:
(S)-1-(2-(((S)-1-(1-(4-(trifluoromethyl)phenyl)-1H-imidazol-4-yl)ethyl)amino) pyrimidin-4-yl)-4,4-dideutero-5-isopropylimidazolidine-2-one US10682352, Compound 88
Type:
Small organic molecule
Emp. Form.:
C22H24F3N7O
Mol. Mass.:
459.4675
SMILES:
CC(C)[C@H]1CNC(=O)N1c1ccnc(N[C@@H](C)c2cn(cn2)-c2ccc(cc2)C(F)(F)F)n1
: