Target
Cyclin-dependent kinase 2/G1/S-specific cyclin-E1
Ligand
BDBM7255
Substrate
GST-Rb fusion protein
Meas. Tech.
CDK Assay
pH
7.4±n/a
Temperature
295.15±n/a K
IC50
68±n/a nM
Citation
 Li, XHuang, PCui, JJZhang, JTang, C Novel pyrrolyllactone and pyrrolyllactam indolinones as potent cyclin-dependent kinase 2 inhibitors. Bioorg Med Chem Lett 13:1939-42 (2003)  
Target
Name:
Cyclin-dependent kinase 2/G1/S-specific cyclin-E1
Synonyms:
CDK2/CycE CDK2/E Cyclin-Dependent Kinase 2 (CDK2) Cyclin-dependent kinase 2/cyclin E1
Type:
Protein
Mol. Mass.:
Description:
Components:
This complex has 2 components.
Component 1
Name:
Cyclin-dependent kinase 2
Synonyms:
CDK2 CDK2_HUMAN Cell division protein kinase 2 Protein cereblon/Cyclin-dependent kinase 2 | p33 protein kinase
Type:
Enzyme Subunit
Mol. Mass.:
33938.17
Organism:
Homo sapiens (Human)
Description:
P24941
Residue:
298
  
Component 2
Name:
G1/S-specific cyclin-E1
Synonyms:
CCNE CCNE1_HUMAN
Type:
Enzyme Subunit
Mol. Mass.:
47073.17
Organism:
Homo sapiens (Human)
Description:
Residue:
410
  
Inhibitor
Name:
BDBM7255
Synonyms:
(3Z)-N,N-dimethyl-2-oxo-3-({4-oxo-2H,4H,5H,6H,7H-pyrrolo[3,4-c]pyridin-1-yl}methylidene)-2,3-dihydro-1H-indole-5-sulfonamide | pyrrollylactam indolinone driv. 16e
Type:
Small organic molecule
Emp. Form.:
C18H18N4O4S
Mol. Mass.:
386.425
SMILES:
CN(C)S(=O)(=O)c1ccc2NC(=O)\C(=C/c3[nH]cc4c3CCNC4=O)c2c1
:
Substrate
Name:
GST-Rb fusion protein
Synonyms:
Glutathione S-transferase (GST)-retinoblastoma (Rb) fusion RB1 Rb | retinoblastoma
Type:
Other Protein Type
Mol. Mass.:
106410.17
Organism:
Homo sapiens (Human)
Description:
GST-60 kDa Rb fusion protein (comprising amino acids 378 to 928 of retinoblastoma)
Residue:
928