Target
Mitogen-activated protein kinase kinase kinase 5
Ligand
BDBM445406
Substrate
Meas. Tech.
HTRF KinEASE Assay
IC50
5.5±n/a nM
Citation
 Wang, GShen, RLong, JMa, JXing, XHe, YGranger, BHe, JWang, BOr, YS Apoptosis signal-regulating kinase 1 inhibitors and methods of use thereof US Patent  US10683279 Publication Date 6/16/2020 
Target
Name:
Mitogen-activated protein kinase kinase kinase 5
Synonyms:
ASK1 MAP3K5 MEKK5
Type:
Protein
Mol. Mass.:
154514.93
Organism:
Homo sapiens (Human)
Description:
Q99683
Residue:
1374
  
Inhibitor
Name:
BDBM445406
Synonyms:
5-(4-cyclopropyl-1H-imidazol-1-yl)-2-fluoro-N-(6-(1-(1-methylcyclo-propyl)-1H-tetrazol-5-yl)pyridin-2-yl)-4-methylbenzamide US10988458, Example 3a | US11560368, Example 3a
Type:
Small organic molecule
Emp. Form.:
C24H23FN8O
Mol. Mass.:
458.4908
SMILES:
Cc1cc(F)c(cc1-n1cnc(c1)C1CC1)C(=O)Nc1cccc(n1)-c1nnnn1C1(C)CC1
: