Target
Mitogen-activated protein kinase kinase kinase 5
Ligand
BDBM445425
Substrate
Meas. Tech.
HTRF KinEASE Assay
IC50
5.5±n/a nM
Citation
 Wang, GShen, RLong, JMa, JXing, XHe, YGranger, BHe, JWang, BOr, YS Apoptosis signal-regulating kinase 1 inhibitors and methods of use thereof US Patent  US10683279 Publication Date 6/16/2020 
Target
Name:
Mitogen-activated protein kinase kinase kinase 5
Synonyms:
ASK1 MAP3K5 MEKK5
Type:
Protein
Mol. Mass.:
154514.93
Organism:
Homo sapiens (Human)
Description:
Q99683
Residue:
1374
  
Inhibitor
Name:
BDBM445425
Synonyms:
US10683279, Example 22a US11560368, Example 22a
Type:
Small organic molecule
Emp. Form.:
C24H25FN8O2
Mol. Mass.:
476.5061
SMILES:
C[C@H](CCO)n1nnnc1-c1cccc(NC(=O)c2cc(c(C)cc2F)-n2cnc(c2)C2CC2)n1
: