Target
Mitogen-activated protein kinase kinase kinase 5
Ligand
BDBM445432
Substrate
Meas. Tech.
HTRF KinEASE Assay
IC50
5.5±n/a nM
Citation
 Wang, GShen, RLong, JMa, JXing, XHe, YGranger, BHe, JWang, BOr, YS Apoptosis signal-regulating kinase 1 inhibitors and methods of use thereof US Patent  US10683279 Publication Date 6/16/2020 
Target
Name:
Mitogen-activated protein kinase kinase kinase 5
Synonyms:
ASK1 MAP3K5 MEKK5
Type:
Protein
Mol. Mass.:
154514.93
Organism:
Homo sapiens (Human)
Description:
Q99683
Residue:
1374
  
Inhibitor
Name:
BDBM445432
Synonyms:
US10683279, Example 29a US11560368, Example 29a
Type:
Small organic molecule
Emp. Form.:
C24H27FN8O
Mol. Mass.:
462.5226
SMILES:
CC(C)n1nnnc1-c1cccc(NC(=O)c2cc(c(C)cc2F)-n2cnc(c2)C(C)(C)C)n1
: