Target
Beta-secretase 1
Ligand
BDBM116228
Substrate
Meas. Tech.
Inhibition Assay
IC50
790±n/a nM
Citation
 Badiger, SChebrolu, MHurth, KJacquier, SLueoend, RMMachauer, RRueeger, HTintelnot-Blomley, MVeenstra, SJVoegtle, M Heterocyclic derivatives and their use in the treatment of neurological disorders US Patent  US10683287 Publication Date 6/16/2020 
Target
Name:
Beta-secretase 1
Synonyms:
ASP2 Aspartyl protease 2 BACE1 Beta-secretase (BACE) Beta-secretase 1 (BACE 1) Beta-secretase 1 (BACE1) Beta-site amyloid precursor protein cleaving enzyme 1 Memapsin-2 beta-Secretase (BACE-1) | beta-Secretase (BACE1)
Type:
Protein
Mol. Mass.:
55755.10
Organism:
Homo sapiens (Human)
Description:
P56817
Residue:
501
  
Inhibitor
Name:
BDBM116228
Synonyms:
US10035794, Example 2 US8637508, 2
Type:
Small organic molecule
Emp. Form.:
C16H16BrN5O2
Mol. Mass.:
390.235
SMILES:
CC1(COCC(N)=N1)c1cccc(NC(=O)c2ccc(Br)cn2)n1
: