Target
Beta-secretase 1
Ligand
BDBM116232
Substrate
Meas. Tech.
Inhibition Assay
IC50
2100±n/a nM
Citation
 Badiger, SChebrolu, MHurth, KJacquier, SLueoend, RMMachauer, RRueeger, HTintelnot-Blomley, MVeenstra, SJVoegtle, M Heterocyclic derivatives and their use in the treatment of neurological disorders US Patent  US10683287 Publication Date 6/16/2020 
Target
Name:
Beta-secretase 1
Synonyms:
ASP2 Aspartyl protease 2 BACE1 Beta-secretase (BACE) Beta-secretase 1 (BACE 1) Beta-secretase 1 (BACE1) Beta-site amyloid precursor protein cleaving enzyme 1 Memapsin-2 beta-Secretase (BACE-1) | beta-Secretase (BACE1)
Type:
Protein
Mol. Mass.:
55755.10
Organism:
Homo sapiens (Human)
Description:
P56817
Residue:
501
  
Inhibitor
Name:
BDBM116232
Synonyms:
US10683287, Example 7 | US8637508, 7
Type:
Small organic molecule
Emp. Form.:
C17H18FN6O2S
Mol. Mass.:
389.427
SMILES:
NC(=S)c1ccc(nc1)C(=O)Nc1cccc(n1)C1(CF)COCC([NH3+])=N1
: