Target
Beta-secretase 1
Ligand
BDBM116264
Substrate
Meas. Tech.
Inhibition Assay
IC50
230±n/a nM
Citation
 Badiger, SChebrolu, MHurth, KJacquier, SLueoend, RMMachauer, RRueeger, HTintelnot-Blomley, MVeenstra, SJVoegtle, M Heterocyclic derivatives and their use in the treatment of neurological disorders US Patent  US10683287 Publication Date 6/16/2020 
Target
Name:
Beta-secretase 1
Synonyms:
ASP2 Aspartyl protease 2 BACE1 Beta-secretase (BACE) Beta-secretase 1 (BACE 1) Beta-secretase 1 (BACE1) Beta-site amyloid precursor protein cleaving enzyme 1 Memapsin-2 beta-Secretase (BACE-1) | beta-Secretase (BACE1)
Type:
Protein
Mol. Mass.:
55755.10
Organism:
Homo sapiens (Human)
Description:
P56817
Residue:
501
  
Inhibitor
Name:
BDBM116264
Synonyms:
US10035794, Example 41 US8637508, 41
Type:
Small organic molecule
Emp. Form.:
C19H20F4N6O2
Mol. Mass.:
440.3947
SMILES:
Cc1cnc(C(=O)Nc2ccc(F)c(n2)[C@]2(C)CO[C@](C)(C(N)=N2)C(F)(F)F)c(C)n1
: