Target
Beta-secretase 1
Ligand
BDBM116267
Substrate
Meas. Tech.
Inhibition Assay
IC50
40.0±n/a nM
Citation
 Badiger, SChebrolu, MHurth, KJacquier, SLueoend, RMMachauer, RRueeger, HTintelnot-Blomley, MVeenstra, SJVoegtle, M Heterocyclic derivatives and their use in the treatment of neurological disorders US Patent  US10683287 Publication Date 6/16/2020 
Target
Name:
Beta-secretase 1
Synonyms:
ASP2 Aspartyl protease 2 BACE1 Beta-secretase (BACE) Beta-secretase 1 (BACE 1) Beta-secretase 1 (BACE1) Beta-site amyloid precursor protein cleaving enzyme 1 Memapsin-2 beta-Secretase (BACE-1) | beta-Secretase (BACE1)
Type:
Protein
Mol. Mass.:
55755.10
Organism:
Homo sapiens (Human)
Description:
P56817
Residue:
501
  
Inhibitor
Name:
BDBM116267
Synonyms:
US10035794, Example 44 US8637508, 44
Type:
Small organic molecule
Emp. Form.:
C18H16F7N7O2
Mol. Mass.:
495.3542
SMILES:
C[C@]1(CO[C@](C)(C(N)=N1)C(F)(F)F)c1nc(NC(=O)c2ncc(nc2N)C(F)(F)F)ccc1F
: