Target
Bromodomain-containing protein 4 [1-477]
Ligand
BDBM445523
Substrate
Meas. Tech.
Time Resolved Fluorescence Resonance Energy Transfer (TR-FRET) Assay
IC50
<5±n/a nM
Citation
 Quesnelle, CAHarikrishnan, LSHill, MD Tricyclic compounds as anticancer agents US Patent  US10683290 Publication Date 6/16/2020 
Target
Name:
Bromodomain-containing protein 4 [1-477]
Synonyms:
BRD4 Bromodomain-containing protein 4 (BRD4)(1-477) | HUNK1
Type:
Enzyme Catalytic Domain
Mol. Mass.:
52863.68
Organism:
Homo sapiens (Human)
Description:
O60885[1-477]
Residue:
475
  
Inhibitor
Name:
BDBM445523
Synonyms:
2-[7-(Dimethyl-1,2-oxazol-4-yl)-5-[(S)-(2-fluorophenyl)(oxan-4-yl)methyl]-5H-pyrido[3,2-b]indol-3-yl]propan-2-ol | US10683290, Example 15
Type:
Small organic molecule
Emp. Form.:
C31H32FN3O3
Mol. Mass.:
513.6025
SMILES:
Cc1noc(C)c1-c1ccc2c(c1)n([C@@H](C1CCOCC1)c1ccccc1F)c1cc(cnc21)C(C)(C)O
: