Target
Bromodomain-containing protein 4 [1-477]
Ligand
BDBM445531
Substrate
Meas. Tech.
Time Resolved Fluorescence Resonance Energy Transfer (TR-FRET) Assay
IC50
<5±n/a nM
Citation
 Quesnelle, CAHarikrishnan, LSHill, MD Tricyclic compounds as anticancer agents US Patent  US10683290 Publication Date 6/16/2020 
Target
Name:
Bromodomain-containing protein 4 [1-477]
Synonyms:
BRD4 Bromodomain-containing protein 4 (BRD4)(1-477) | HUNK1
Type:
Enzyme Catalytic Domain
Mol. Mass.:
52863.68
Organism:
Homo sapiens (Human)
Description:
O60885[1-477]
Residue:
475
  
Inhibitor
Name:
BDBM445531
Synonyms:
1-Cyclopropyl-1-[7-(dimethyl-1H-1,2,3-triazol-5-yl)-8-fluoro-5-[(S)-(2-fluorophenyl)(oxan-4-yl)methyl]-5H-pyrido[3,2-b]indol-3-yl]ethan-1-ol US10683290, Example 24
Type:
Small organic molecule
Emp. Form.:
C32H33F2N5O2
Mol. Mass.:
557.6335
SMILES:
Cc1nnn(C)c1-c1cc2n([C@@H](C3CCOCC3)c3ccccc3F)c3cc(cnc3c2cc1F)C(C)(O)C1CC1
: