Target
Bromodomain-containing protein 4 [1-477]
Ligand
BDBM445556
Substrate
Meas. Tech.
Time Resolved Fluorescence Resonance Energy Transfer (TR-FRET) Assay
IC50
<5±n/a nM
Citation
 Quesnelle, CAHarikrishnan, LSHill, MD Tricyclic compounds as anticancer agents US Patent  US10683290 Publication Date 6/16/2020 
Target
Name:
Bromodomain-containing protein 4 [1-477]
Synonyms:
BRD4 Bromodomain-containing protein 4 (BRD4)(1-477) | HUNK1
Type:
Enzyme Catalytic Domain
Mol. Mass.:
52863.68
Organism:
Homo sapiens (Human)
Description:
O60885[1-477]
Residue:
475
  
Inhibitor
Name:
BDBM445556
Synonyms:
US10683290, Example 54
Type:
Small organic molecule
Emp. Form.:
C28H30FN7O2
Mol. Mass.:
515.5819
SMILES:
Cc1nnn(C)c1-c1cc2n([C@@H](C3CCOCC3)c3ncccn3)c3cc(cnc3c2cc1F)C(C)(C)O
: